face-off-n
type: LexicalEntry
canonical form: face-off
sense: 00239891-n
part of speech: noun

00239891-n
type: LexicalConcept
in scheme: en-word.net
definition: (ice hockey) the method of starting play; a referee drops the puck between two opposing players
ili: i36660
lexfile: noun.act
part of speech: noun
domain topic: 00464604-n
hypernym: 00236302-n