reversal-n
type: LexicalEntry
canonical form: reversal
sense: 00235759-n
part of speech: noun

00235759-n
type: LexicalConcept
in scheme: en-word.net
definition: a change from one state to the opposite state
example: there was a reversal of autonomic function
ili: i36644
lexfile: noun.act
part of speech: noun
hypernym: 00199979-n