rarefy-v
type: LexicalEntry
canonical form: rarefy
sense: 00226805-v
part of speech: verb

attenuate-v
type: LexicalEntry
canonical form: attenuate
sense: 00226805-v
part of speech: verb

00226805-v
type: LexicalConcept
in scheme: en-word.net
definition: weaken the consistency of (a chemical substance)
ili: i22853
lexfile: verb.change
part of speech: verb
domain topic: 06094057-n
hypernym: 00225327-v