poisoning-n
type: LexicalEntry
canonical form: poisoning
sense: 00225605-n
part of speech: noun

00225605-n
type: LexicalConcept
in scheme: en-word.net
definition: the act of giving poison to a person or animal with the intent to kill
ili: i36588
lexfile: noun.act
part of speech: noun
hypernym: 00219879-n