lubricate-v
type: LexicalEntry
canonical form: lubricate
sense: 00219438-v
part of speech: verb

00219438-v
type: LexicalConcept
in scheme: en-word.net
definition: make slippery or smooth through the application of a lubricant
example: lubricate the key
ili: i22815
lexfile: verb.change
part of speech: verb
hypernym: 00126072-v