parch-v
type: LexicalEntry
canonical form: parch
sense: 00218756-v
part of speech: verb

sear-v
type: LexicalEntry
canonical form: sear
sense: 00218756-v
part of speech: verb

00218756-v
type: LexicalConcept
in scheme: en-word.net
definition: cause to wither or parch from exposure to heat
example: The sun parched the earth
ili: i22812
lexfile: verb.change
part of speech: verb
hypernym: 00218901-v