destruction-n
type: LexicalEntry
canonical form: destruction
sense: 00217881-n
part of speech: noun

devastation-n
type: LexicalEntry
canonical form: devastation
sense: 00217881-n
part of speech: noun

00217881-n
type: LexicalConcept
in scheme: en-word.net
definition: the termination of something by causing so much damage to it that it cannot be repaired or no longer exists
ili: i36544
lexfile: noun.act
part of speech: noun
hypernym: 00210792-n