suspension-n
type: LexicalEntry
canonical form: suspension
sense: 00209981-n
part of speech: noun

temporary removal-n
type: LexicalEntry
canonical form: temporary removal
sense: 00209981-n
part of speech: noun

00209981-n
type: LexicalConcept
in scheme: en-word.net
definition: a temporary debarment (from a privilege or position etc.)
ili: i36504
lexfile: noun.act
part of speech: noun
hypernym: 01079805-n