bolt-n
type: LexicalEntry
canonical form: bolt
sense: 00205792-n
part of speech: noun

00205792-n
type: LexicalConcept
in scheme: en-word.net
definition: a sudden abandonment (as from a political party)
ili: i36483
lexfile: noun.act
part of speech: noun
domain topic: 06157599-n
hypernym: 00205288-n