reaction-n
type: LexicalEntry
canonical form: reaction
sense: 00203665-n
part of speech: noun

00203665-n
type: LexicalConcept
in scheme: en-word.net
definition: doing something in opposition to another way of doing it that you don't like
example: his style of painting was a reaction against cubism
ili: i36471
lexfile: noun.act
part of speech: noun
hypernym: 00203133-n