resistance-n
type: LexicalEntry
canonical form: resistance
sense: 00203133-n
part of speech: noun

opposition-n
type: LexicalEntry
canonical form: opposition
sense: 00203133-n
part of speech: noun

00203133-n
type: LexicalConcept
in scheme: en-word.net
definition: the action of opposing something that you disapprove or disagree with
example: he encountered a general feeling of resistance from many citizens
example: despite opposition from the newspapers he went ahead
ili: i36469
lexfile: noun.act
part of speech: noun
hypernym: 00038116-n