burn-v
type: LexicalEntry
canonical form: burn
sense: 00196708-v
part of speech: verb

00196708-v
type: LexicalConcept
in scheme: en-word.net
definition: damage by burning with heat, fire, or radiation
example: The iron burnt a hole in my dress
ili: i22702
lexfile: verb.change
part of speech: verb
hypernym: 00259743-v