economy-n
type: LexicalEntry
canonical form: economy
sense: 00193462-n
part of speech: noun

saving-n
type: LexicalEntry
canonical form: saving
sense: 00193462-n
part of speech: noun

00193462-n
type: LexicalConcept
in scheme: en-word.net
definition: an act of economizing; reduction in cost
example: it was a small economy to walk to work every day
example: there was a saving of 50 cents
ili: i36423
lexfile: noun.act
part of speech: noun
hypernym: 00038116-n