petrify-v
type: LexicalEntry
canonical form: petrify
sense: 00192803-v
part of speech: verb

00192803-v
type: LexicalConcept
in scheme: en-word.net
definition: cause to become stonelike or stiff or dazed and stunned from fright
example: The horror petrified his feelings
example: Fear petrified her thinking
ili: i22680
lexfile: verb.change
part of speech: verb
hypernym: 00192383-v