solution-n
type: LexicalEntry
canonical form: solution
sense: 00191632-n
part of speech: noun

00191632-n
type: LexicalConcept
in scheme: en-word.net
definition: the successful action of solving a problem
example: the solution took three hours
ili: i36416
lexfile: noun.act
part of speech: noun
hypernym: 00064472-n