field goal-n
type: LexicalEntry
canonical form: field goal
sense: 00189783-n
part of speech: noun

00189783-n
type: LexicalConcept
in scheme: en-word.net
definition: a score in American football; a score made by kicking the ball between the opponents' goal posts
ili: i36405
lexfile: noun.act
part of speech: noun
domain topic: 00470726-n
hypernym: 00187483-n