strike-n
type: LexicalEntry
canonical form: strike
sense: 00188559-n
part of speech: noun

ten-strike-n
type: LexicalEntry
canonical form: ten-strike
sense: 00188559-n
part of speech: noun

00188559-n
type: LexicalConcept
in scheme: en-word.net
definition: a score in tenpins: knocking down all ten with the first ball
example: he finished with three strikes in the tenth frame
ili: i36397
lexfile: noun.act
part of speech: noun
hypernym: 00187483-n