dash-v
type: LexicalEntry
canonical form: dash
sense: 00184522-v
part of speech: verb

00184522-v
type: LexicalConcept
in scheme: en-word.net
definition: add an enlivening or altering element to
example: blue paint dashed with white
ili: i22630
lexfile: verb.change
part of speech: verb
hypernym: 00184262-v