include-v
type: LexicalEntry
canonical form: include
sense: 00184024-v
part of speech: verb

00184024-v
type: LexicalConcept
in scheme: en-word.net
definition: add as part of something else; put in as part of a set, group, or category
example: We must include this chemical element in the group
ili: i22628
lexfile: verb.change
part of speech: verb
domain topic: 06094057-n
hypernym: 00182551-v