resolution-n
type: LexicalEntry
canonical form: resolution
sense: 00181077-n
part of speech: noun

00181077-n
type: LexicalConcept
in scheme: en-word.net
definition: a decision to do something or to behave in a certain manner
example: he always wrote down his New Year's resolutions
ili: i36360
lexfile: noun.act
part of speech: noun
hypernym: 00163453-n