clean-v
type: LexicalEntry
canonical form: clean
sense: 00177724-v
part of speech: verb

pick-v
type: LexicalEntry
canonical form: pick
sense: 00177724-v
part of speech: verb

00177724-v
type: LexicalConcept
in scheme: en-word.net
definition: remove unwanted substances from, such as feathers or pits
example: Clean the turkey
ili: i22590
lexfile: verb.change
part of speech: verb
hypernym: 00173351-v