gambit-n
type: LexicalEntry
canonical form: gambit
sense: 00168771-n
part of speech: noun

00168771-n
type: LexicalConcept
in scheme: en-word.net
definition: a chess move early in the game in which the player sacrifices minor pieces in order to obtain an advantageous position
ili: i36292
lexfile: noun.act
part of speech: noun
hypernym: 00167176-n