checkmate-n
type: LexicalEntry
canonical form: checkmate
sense: 00168585-n
part of speech: noun

mate-n
type: LexicalEntry
canonical form: mate
sense: 00168585-n
part of speech: noun

00168585-n
type: LexicalConcept
in scheme: en-word.net
definition: a chess move constituting an inescapable and indefensible attack on the opponent's king
ili: i36291
lexfile: noun.act
part of speech: noun
hypernym: 00167176-n