consolidate-v
type: LexicalEntry
canonical form: consolidate
sense: 00165426-v
part of speech: verb

00165426-v
type: LexicalConcept
in scheme: en-word.net
definition: make or form into a solid or hardened mass
example: consolidate fibers into boards
ili: i22535
lexfile: verb.change
part of speech: verb
hypernym: 00446422-v