assignment-n
type: LexicalEntry
canonical form: assignment
sense: 00165166-n
part of speech: noun

assigning-n
type: LexicalEntry
canonical form: assigning
sense: 00165166-n
part of speech: noun

00165166-n
type: LexicalConcept
in scheme: en-word.net
definition: the act of distributing something to designated places or persons
example: the first task is the assignment of an address to each datum
ili: i36273
lexfile: noun.act
part of speech: noun
hypernym: 01085001-n