replace-v
type: LexicalEntry
canonical form: replace
sense: 00162496-v
part of speech: verb

00162496-v
type: LexicalConcept
in scheme: en-word.net
definition: substitute a person or thing for (another that is broken or inefficient or lost or no longer working or yielding what is expected)
example: He replaced the old razor blade
example: We need to replace the secretary that left a month ago
example: the insurance will replace the lost income
example: This antique vase can never be replaced
ili: i22522
lexfile: verb.change
part of speech: verb
hypernym: 01634614-v
similar: 02410532-v