approximation-n
type: LexicalEntry
canonical form: approximation
sense: 00147097-n
part of speech: noun

bringing close together-n
type: LexicalEntry
canonical form: bringing close together
sense: 00147097-n
part of speech: noun

00147097-n
type: LexicalConcept
in scheme: en-word.net
definition: the act of bringing near or bringing together especially the cut edges of tissue
ili: i36179
lexfile: noun.act
part of speech: noun
hypernym: 00146038-n