hook-n
type: LexicalEntry
canonical form: hook
sense: 00136619-n
part of speech: noun

00136619-n
type: LexicalConcept
in scheme: en-word.net
definition: a short swinging punch delivered from the side with the elbow bent
ili: i36128
lexfile: noun.act
part of speech: noun
hypernym: 00135600-n