turn-v
type: LexicalEntry
canonical form: turn
sense: 00125649-v
part of speech: verb

grow-v
type: LexicalEntry
canonical form: grow
sense: 00125649-v
part of speech: verb

00125649-v
type: LexicalConcept
in scheme: en-word.net
definition: pass into a condition gradually, take on a specific property or attribute; become
example: The weather turned nasty
example: She grew angry
ili: i22387
lexfile: verb.change
part of speech: verb
hypernym: 00109468-v
similar: 00145958-v