gun-n
type: LexicalEntry
canonical form: gun
sense: 00124250-n
part of speech: noun

00124250-n
type: LexicalConcept
in scheme: en-word.net
definition: the discharge of a firearm as signal or as a salute in military ceremonies
example: two runners started before the gun
example: a twenty gun salute
ili: i36053
lexfile: noun.act
part of speech: noun
domain topic: 08215965-n
hypernym: 00124054-n