alternate-v
type: LexicalEntry
canonical form: alternate
sense: 00121314-v
part of speech: verb

jump-v
type: LexicalEntry
canonical form: jump
sense: 00121314-v
part of speech: verb

00121314-v
type: LexicalConcept
in scheme: en-word.net
definition: go back and forth; swing back and forth between two states or conditions
ili: i22367
lexfile: verb.change
part of speech: verb
hypernym: 00122978-v