heave-n
type: LexicalEntry
canonical form: heave
sense: 00106091-n
part of speech: noun

heaving-n
type: LexicalEntry
canonical form: heaving
sense: 00106091-n
part of speech: noun

00106091-n
type: LexicalConcept
in scheme: en-word.net
definition: throwing something heavy (with great effort)
example: he gave it a mighty heave
example: he was not good at heaving passes
ili: i35958
lexfile: noun.act
part of speech: noun
hypernym: 00105359-n