feel-v
type: LexicalEntry
canonical form: feel
sense: 00105712-v
part of speech: verb

00105712-v
type: LexicalConcept
in scheme: en-word.net
definition: be conscious of a physical, mental, or emotional state
example: My cold is gone — I feel fine today
example: She felt tired after the long hike
example: She felt sad after her loss
ili: i22302
lexfile: verb.body
part of speech: verb
hypernym: 02110960-v