sunburn-v
type: LexicalEntry
canonical form: sunburn
sense: 00104053-v
part of speech: verb

burn-v
type: LexicalEntry
canonical form: burn
sense: 00104053-v
part of speech: verb

00104053-v
type: LexicalConcept
in scheme: en-word.net
definition: get a sunburn by overexposure to the sun
ili: i22295
lexfile: verb.body
part of speech: verb
hypernym: 00281861-v