train-v
type: LexicalEntry
canonical form: train
sense: 00099798-v
part of speech: verb

00099798-v
type: LexicalConcept
in scheme: en-word.net
definition: exercise in order to prepare for an event or competition
example: She is training for the Olympics
ili: i22273
lexfile: verb.body
part of speech: verb
hypernym: 00099475-v
similar: 00835381-v