reparation-n
type: LexicalEntry
canonical form: reparation
sense: 00096149-n
part of speech: noun

amends-n
type: LexicalEntry
canonical form: amends
sense: 00096149-n
part of speech: noun

00096149-n
type: LexicalConcept
in scheme: en-word.net
definition: something done or paid in expiation of a wrong
example: how can I make amends
ili: i35904
lexfile: noun.act
part of speech: noun
hypernym: 00095941-n