giving-n
type: LexicalEntry
canonical form: giving
sense: 00091599-n
part of speech: noun

00091599-n
type: LexicalConcept
in scheme: en-word.net
definition: disposing of property by voluntary transfer without receiving value in return
example: the alumni followed a program of annual giving
ili: i35880
lexfile: noun.act
part of speech: noun
hypernym: 00044347-n