maim-v
type: LexicalEntry
canonical form: maim
sense: 00090640-v
part of speech: verb

00090640-v
type: LexicalConcept
in scheme: en-word.net
definition: injure or wound seriously and leave permanent disfiguration or mutilation
example: people were maimed by the explosion
ili: i22226
lexfile: verb.body
part of speech: verb
hypernym: 00069650-v