hard-hitting-a
type: LexicalEntry
canonical form: hard-hitting
sense: 00083766-s
part of speech: adjective

high-pressure-a
type: LexicalEntry
canonical form: high-pressure
sense: 00083766-s
part of speech: adjective

00083766-s
type: LexicalConcept
in scheme: en-word.net
definition: aggressively and persistently persuasive
example: a hard-hitting advertising campaign
example: a high-pressure salesman
ili: i440
lexfile: adj.all
part of speech: adjective satellite
similar: https://en-word.net/synset/00082711-a