acceptance-n
type: LexicalEntry
canonical form: acceptance
sense: 00083345-n
part of speech: noun

00083345-n
type: LexicalConcept
in scheme: en-word.net
definition: the act of taking something that is offered
example: her acceptance of the gift encouraged him
example: he anticipated their acceptance of his offer
ili: i35841
lexfile: noun.act
part of speech: noun
hypernym: 00078239-n