choke-v
type: LexicalEntry
canonical form: choke
sense: 00077703-v
part of speech: verb

strangle-v
type: LexicalEntry
canonical form: strangle
sense: 00077703-v
part of speech: verb

00077703-v
type: LexicalConcept
in scheme: en-word.net
definition: constrict (someone's) throat and keep from breathing
ili: i22160
lexfile: verb.body
part of speech: verb
causes: 00002724-v
hypernym: 01390440-v