track record-n
type: LexicalEntry
canonical form: track record
sense: 00064130-n
part of speech: noun

00064130-n
type: LexicalConcept
in scheme: en-word.net
definition: the fastest time ever recorded for a specific distance at a particular racetrack
example: the track record for the mile and a half at Belmont is 2 minutes 24 seconds held by Secretariat since 1973
ili: i35740
lexfile: noun.act
part of speech: noun
hypernym: 00063834-n