record-n
type: LexicalEntry
canonical form: record
sense: 00063834-n
part of speech: noun

00063834-n
type: LexicalConcept
in scheme: en-word.net
definition: an extreme attainment; the best (or worst) performance ever attested (as in a sport)
example: he tied the Olympic record
example: coffee production last year broke all previous records
example: Chicago set the homicide record
ili: i35739
lexfile: noun.act
part of speech: noun
hypernym: 00063626-n