clean-a
type: LexicalEntry
canonical form: clean
sense: 00061923-s
part of speech: adjective

neat-a
type: LexicalEntry
canonical form: neat
sense: 00061923-s
part of speech: adjective

00061923-s
type: LexicalConcept
in scheme: en-word.net
definition: free from clumsiness; precisely or deftly executed
example: he landed a clean left on his opponent's cheek
example: a clean throw
example: the neat exactness of the surgeon's knife
ili: i327
lexfile: adj.all
part of speech: adjective satellite
similar: https://en-word.net/synset/00061521-a