breed-v
type: LexicalEntry
canonical form: breed
sense: 00056076-v
part of speech: verb

multiply-v
type: LexicalEntry
canonical form: multiply
sense: 00056076-v
part of speech: verb

00056076-v
type: LexicalConcept
in scheme: en-word.net
definition: have young (animals) or reproduce (organisms)
example: pandas rarely breed in captivity
ili: i22054
lexfile: verb.body
part of speech: verb
hypernym: 00054856-v