retirement-n
type: LexicalEntry
canonical form: retirement
sense: 00055472-n
part of speech: noun

retreat-n
type: LexicalEntry
canonical form: retreat
sense: 00055472-n
part of speech: noun

00055472-n
type: LexicalConcept
in scheme: en-word.net
definition: withdrawal for prayer and study and meditation
example: the religious retreat is a form of vacation activity
ili: i35692
lexfile: noun.act
part of speech: noun
hypernym: 00054733-n