comeback-n
type: LexicalEntry
canonical form: comeback
sense: 00051897-n
part of speech: noun

00051897-n
type: LexicalConcept
in scheme: en-word.net
definition: return by a celebrity to some previously successful activity
ili: i35672
lexfile: noun.act
part of speech: noun
hypernym: 00051707-n