hit-n
type: LexicalEntry
canonical form: hit
sense: 00044640-n
part of speech: noun

00044640-n
type: LexicalConcept
in scheme: en-word.net
definition: (baseball) when a batter strikes a pitched ball into fair territory and arrives safely on base (without an error or a fielder's choice being made by the defense)
example: he came all the way around on Williams' hit
ili: i35638
lexfile: noun.act
part of speech: noun
domain topic: 00472688-n
hypernym: 00037483-n