activated-a
type: LexicalEntry
canonical form: activated
sense: 00042912-s
part of speech: adjective

00042912-s
type: LexicalConcept
in scheme: en-word.net
definition: rendered active; e.g. rendered radioactive or luminescent or photosensitive or conductive
ili: i216
lexfile: adj.all
part of speech: adjective satellite
similar: https://en-word.net/synset/00042677-a