wash-v
type: LexicalEntry
canonical form: wash
sense: 00036355-v
part of speech: verb

lave-v
type: LexicalEntry
canonical form: lave
sense: 00036355-v
part of speech: verb

00036355-v
type: LexicalConcept
in scheme: en-word.net
definition: cleanse (one's body) with soap and water
ili: i21947
lexfile: verb.body
part of speech: verb
hypernym: 00035769-v
similar: 00036171-v